Target
3-phosphoinositide-dependent protein kinase 1
Ligand
BDBM92492
Substrate
Meas. Tech.
ChEMBL_949687 (CHEMBL2343758)
IC50
5700±n/a nM
Citation
 Medina, JR Selective 3-phosphoinositide-dependent kinase 1 (PDK1) inhibitors: dissecting the function and pharmacology of PDK1. J Med Chem 56:2726-37 (2013)  
Target
Name:
3-phosphoinositide-dependent protein kinase 1
Synonyms:
3-Phosphoinositide-Dependent Protein Kinase 1 (PDK1) 3-phosphoinositide-dependent protein kinase 1 3-phosphoinositide-dependent protein kinase 1 (PDK-1) Isoform 2 of 3-phosphoinositide-dependent protein kinase 1 PDPK1 Phosphoinositide-dependent protein kinase 1 (PDK1) hPDK1
Type:
Enzyme
Mol. Mass.:
63157.65
Organism:
Homo sapiens (Human)
Description:
O15530
Residue:
556
  
Inhibitor
Name:
BDBM92492
Synonyms:
Alkaloid 1
Type:
Small organic molecule
Emp. Form.:
C26H34N4O3
Mol. Mass.:
450.5732
SMILES:
CCNC(=O)O[C@@H]1CC[C@@H]2[C@H](C[C@H]1N2Cc1ccccc1)C(=O)Nc1ccc(cc1)N(C)C
: