Target
3-phosphoinositide-dependent protein kinase 1
Ligand
BDBM50321382
Substrate
Meas. Tech.
ChEMBL_949689 (CHEMBL2343760)
EC50
133000±n/a nM
Citation
 Medina, JR Selective 3-phosphoinositide-dependent kinase 1 (PDK1) inhibitors: dissecting the function and pharmacology of PDK1. J Med Chem 56:2726-37 (2013)  
Target
Name:
3-phosphoinositide-dependent protein kinase 1
Synonyms:
3-Phosphoinositide-Dependent Protein Kinase 1 (PDK1) 3-phosphoinositide-dependent protein kinase 1 3-phosphoinositide-dependent protein kinase 1 (PDK-1) Isoform 2 of 3-phosphoinositide-dependent protein kinase 1 PDPK1 Phosphoinositide-dependent protein kinase 1 (PDK1) hPDK1
Type:
Enzyme
Mol. Mass.:
63157.65
Organism:
Homo sapiens (Human)
Description:
O15530
Residue:
556
  
Inhibitor
Name:
BDBM50321382
Synonyms:
2-(3-(4-chlorophenyl)-3-oxo-1-phenylpropylthio)acetic acid CHEMBL550259 | PS46
Type:
Small organic molecule
Emp. Form.:
C17H15ClO3S
Mol. Mass.:
334.817
SMILES:
OC(=O)CSC(CC(=O)c1ccc(Cl)cc1)c1ccccc1
: