Target
Serine/threonine-protein kinase mTOR
Ligand
BDBM50430628
Substrate
Meas. Tech.
ChEMBL_949692 (CHEMBL2343763)
IC50
1300±n/a nM
Citation
 Medina, JR Selective 3-phosphoinositide-dependent kinase 1 (PDK1) inhibitors: dissecting the function and pharmacology of PDK1. J Med Chem 56:2726-37 (2013)  
Target
Name:
Serine/threonine-protein kinase mTOR
Synonyms:
FK506-binding protein 12-rapamycin complex-associated protein 1 FRAP FRAP1 MTOR Mammalian Target of Rapamycin (mTOR) RAFT1 Rapamycin and FKBP12 target 1 Serine/threonine-protein kinase (mTOR) | mTORC2
Type:
Rapamycin target protein
Mol. Mass.:
288917.12
Organism:
Homo sapiens (Human)
Description:
P42345
Residue:
2549
  
Inhibitor
Name:
BDBM50430628
Synonyms:
CHEMBL2332032
Type:
Small organic molecule
Emp. Form.:
C13H23O21P5
Mol. Mass.:
670.1779
SMILES:
OP(O)(=O)O[C@H]1[C@@H](OCc2ccccc2)[C@H](OP(O)(O)=O)[C@@H](OP(O)(O)=O)[C@H](OP(O)(O)=O)[C@H]1OP(O)(O)=O
: