Target
3-phosphoinositide-dependent protein kinase 1
Ligand
BDBM19087
Substrate
Meas. Tech.
ChEMBL_942048 (CHEMBL2340278)
IC50
60±n/a nM
Citation
 Medina, JR Selective 3-phosphoinositide-dependent kinase 1 (PDK1) inhibitors: dissecting the function and pharmacology of PDK1. J Med Chem 56:2726-37 (2013)  
Target
Name:
3-phosphoinositide-dependent protein kinase 1
Synonyms:
3-Phosphoinositide-Dependent Protein Kinase 1 (PDK1) 3-phosphoinositide-dependent protein kinase 1 3-phosphoinositide-dependent protein kinase 1 (PDK-1) Isoform 2 of 3-phosphoinositide-dependent protein kinase 1 PDPK1 Phosphoinositide-dependent protein kinase 1 (PDK1) hPDK1
Type:
Enzyme
Mol. Mass.:
63157.65
Organism:
Homo sapiens (Human)
Description:
O15530
Residue:
556
  
Inhibitor
Name:
BDBM19087
Synonyms:
15,16-dimethoxy-6-methyl-8,12-diazatetracyclo[8.8.0.0^{2,7}.0^{13,18}]octadeca-1(10),2(7),3,5,8,11,13,15,17-nonaene-5,9-diamine | Dibenzo[c,f][2,7]naphthyridine, 1
Type:
Small organic molecule
Emp. Form.:
C19H18N4O2
Mol. Mass.:
334.3718
SMILES:
COc1cc2ncc3c(N)nc4c(C)c(N)ccc4c3c2cc1OC
: