Target
Mast/stem cell growth factor receptor Kit
Ligand
BDBM50430868
Substrate
Meas. Tech.
ChEMBL_945423 (CHEMBL2342534)
IC50
3.0±n/a nM
Citation
 Gao, MDuan, LLuo, JZhang, LLu, XZhang, YZhang, ZTu, ZXu, YRen, XDing, K Discovery and optimization of 3-(2-(Pyrazolo[1,5-a]pyrimidin-6-yl)ethynyl)benzamides as novel selective and orally bioavailable discoidin domain receptor 1 (DDR1) inhibitors. J Med Chem 56:3281-95 (2013)  
Target
Name:
Mast/stem cell growth factor receptor Kit
Synonyms:
CD117 antigen KIT Mast/stem cell growth factor receptor Kit (cKIT) Proto-oncogene tyrosine-protein kinase Kit Stem cell growth factor receptor Tyrosine-protein kinase Kit c-kit v-kit Hardy-Zuckerman 4 feline sarcoma viral oncogene homolog
Type:
Protein
Mol. Mass.:
109869.37
Organism:
Homo sapiens (Human)
Description:
P10721
Residue:
976
  
Inhibitor
Name:
BDBM50430868
Synonyms:
CHEMBL2331602
Type:
Small organic molecule
Emp. Form.:
C23H18N4O
Mol. Mass.:
366.4152
SMILES:
Cc1cccc(NC(=O)c2ccc(C)c(c2)C#Cc2cnc3ccnn3c2)c1
: