Target
Proteasome subunit beta type-5
Ligand
BDBM50430967
Substrate
Meas. Tech.
ChEMBL_946850 (CHEMBL2345515)
Ki
2.3±n/a nM
Citation
 Desvergne, AGenin, EMaréchal, XGallastegui, NDufau, LRichy, NGroll, MVidal, JReboud-Ravaux, M Dimerized linear mimics of a natural cyclopeptide (TMC-95A) are potent noncovalent inhibitors of the eukaryotic 20S proteasome. J Med Chem 56:3367-78 (2013)  
Target
Name:
Proteasome subunit beta type-5
Synonyms:
20S proteasome chymotrypsin-like LMPX PSB5_HUMAN Proteasome Macropain subunit MB1 X
Type:
Protein
Mol. Mass.:
28480.96
Organism:
Homo sapiens (Human)
Description:
Residue:
263
  
Inhibitor
Name:
BDBM50430967
Synonyms:
CHEMBL2337848
Type:
Small organic molecule
Emp. Form.:
C34H39N5O10
Mol. Mass.:
677.701
SMILES:
CC[C@H](C)C(=O)C(=O)N[C@H]1Cc2ccc(O)c(c2)-c2cccc3c2NC(=O)[C@@]3(O)[C@H](O)[C@H](NC(=O)[C@H](CC(N)=O)CC1=O)C(=O)N\C=C/C
: