Target
Proteasome subunit beta type-1
Ligand
BDBM50430970
Substrate
Meas. Tech.
ChEMBL_946854 (CHEMBL2345965)
IC50
448±n/a nM
Citation
 Desvergne, AGenin, EMaréchal, XGallastegui, NDufau, LRichy, NGroll, MVidal, JReboud-Ravaux, M Dimerized linear mimics of a natural cyclopeptide (TMC-95A) are potent noncovalent inhibitors of the eukaryotic 20S proteasome. J Med Chem 56:3367-78 (2013)  
Target
Name:
Proteasome subunit beta type-1
Synonyms:
PSB1_HUMAN PSMB1 Proteasome subunit beta type-1/beta type-5
Type:
PROTEIN
Mol. Mass.:
26493.62
Organism:
Homo sapiens (Human)
Description:
ChEMBL_1366691
Residue:
241
  
Inhibitor
Name:
BDBM50430970
Synonyms:
CHEMBL2337845
Type:
Small organic molecule
Emp. Form.:
C110H139N15O19
Mol. Mass.:
1975.3698
SMILES:
C[C@H](NC(=O)[C@H](Cc1ccc(OCc2ccccc2)cc1)NC(=O)CCCCCNC(=O)CCCCCNC(=O)CCCCCNC(=O)CCCCCNC(=O)CCCCCNC(=O)CCCCC(=O)N[C@@H](Cc1ccc(OCc2ccccc2)cc1)C(=O)N[C@@H](C)C(=O)N[C@@H](C[C@]1(O)C(=O)Nc2ccccc12)C(=O)NCc1ccccc1)C(=O)N[C@@H](C[C@]1(O)C(=O)Nc2ccccc12)C(=O)NCc1ccccc1
: