Target
Protein kinase C alpha type
Ligand
BDBM50425008
Substrate
Meas. Tech.
ChEMBL_954047 (CHEMBL2350815)
IC50
>5000±n/a nM
Citation
 Shao, HShi, SHuang, SHole, AJAbbas, AYBaumli, SLiu, XLam, FFoley, DWFischer, PMNoble, MEndicott, JAPepper, CWang, S Substituted 4-(thiazol-5-yl)-2-(phenylamino)pyrimidines are highly active CDK9 inhibitors: synthesis, X-ray crystal structures, structure-activity relationship, and anticancer activities. J Med Chem 56:640-59 (2013)  
Target
Name:
Protein kinase C alpha type
Synonyms:
KPCA_HUMAN PKC alpha and beta-2 PKC-alpha PRKACA Protein Kinase C- alpha Protein kinase C alpha (PKCa) Protein kinase C alpha type (PRKCA) RAF proto-oncogene serine/threonine-protein kinase
Type:
Enzyme
Mol. Mass.:
76755.65
Organism:
Homo sapiens (Human)
Description:
The recombinant human PKC enzymes were produced using a baculovirus expression system in SF9 cells
Residue:
672
  
Inhibitor
Name:
BDBM50425008
Synonyms:
CHEMBL2312185
Type:
Small organic molecule
Emp. Form.:
C21H24N8S
Mol. Mass.:
420.534
SMILES:
CNc1nc(C)c(s1)-c1nc(Nc2cccc(c2)N2CCCNCC2)ncc1C#N
: