Target
Beta-secretase 1
Ligand
BDBM50432632
Substrate
Meas. Tech.
ChEMBL_950722 (CHEMBL2353183)
IC50
16±n/a nM
Citation
 Hilpert, HGuba, WWoltering, TJWostl, WPinard, EMauser, HMayweg, AVRogers-Evans, MHumm, RKrummenacher, DMuser, TSchnider, CJacobsen, HOzmen, LBergadano, ABanner, DWHochstrasser, RKuglstatter, ADavid-Pierson, PFischer, HPolara, ANarquizian, R ß-Secretase (BACE1) inhibitors with high in vivo efficacy suitable for clinical evaluation in Alzheimer's disease. J Med Chem 56:3980-95 (2013)  
Target
Name:
Beta-secretase 1
Synonyms:
ASP2 Aspartyl protease 2 BACE1 Beta-secretase (BACE) Beta-secretase 1 (BACE 1) Beta-secretase 1 (BACE1) Beta-site amyloid precursor protein cleaving enzyme 1 Memapsin-2 beta-Secretase (BACE-1) | beta-Secretase (BACE1)
Type:
Protein
Mol. Mass.:
55755.10
Organism:
Homo sapiens (Human)
Description:
P56817
Residue:
501
  
Inhibitor
Name:
BDBM50432632
Synonyms:
CHEMBL2347211
Type:
Small organic molecule
Emp. Form.:
C17H16ClFN4OS
Mol. Mass.:
378.852
SMILES:
C[C@]1(CCSC(N)=N1)c1cc(NC(=O)c2ccc(Cl)cn2)ccc1F
: