Target
Beta-3 adrenergic receptor
Ligand
BDBM25750
Substrate
Meas. Tech.
ChEMBL_952277 (CHEMBL2351583)
Kd
19953±n/a nM
Citation
 Mistry, SNBaker, JGFischer, PMHill, SJGardiner, SMKellam, B Synthesis and in vitro and in vivo characterization of highlyß1-selectiveß-adrenoceptor partial agonists. J Med Chem 56:3852-65 (2013)  
Target
Name:
Beta-3 adrenergic receptor
Synonyms:
ADRB3 ADRB3_HUMAN Beta-2 adrenergic receptor and beta-3 adrenergic receptor Beta-3 adrenoreceptor | adrenergic Beta3
Type:
G Protein-Coupled Receptor (GPCR)
Mol. Mass.:
43534.88
Organism:
Homo sapiens (Human)
Description:
Residue:
408
  
Inhibitor
Name:
BDBM25750
Synonyms:
N-(2-{[(2R)-2-hydroxy-3-(4-hydroxyphenoxy)propyl]amino}ethyl)morpholine-4-carboxamide | Xamoterol
Type:
Small organic molecule
Emp. Form.:
C16H25N3O5
Mol. Mass.:
339.3868
SMILES:
O[C@H](CNCCNC(=O)N1CCOCC1)COc1ccc(O)cc1
: