Target
Cannabinoid receptor 2
Ligand
BDBM50432724
Substrate
Meas. Tech.
ChEMBL_952581 (CHEMBL2354094)
Ki
67±n/a nM
Citation
 Thakur, GABajaj, SParonis, CPeng, YBowman, ALBarak, LSCaron, MGParrish, DDeschamps, JRMakriyannis, A Novel adamantyl cannabinoids as CB1 receptor probes. J Med Chem 56:3904-21 (2013)  
Target
Name:
Cannabinoid receptor 2
Synonyms:
CANNABINOID CB2 CB2 CB2B CNR2_HUMAN Cannabinoid CB2 receptor Cannabinoid receptor 2 (CB2R) | hCB2
Type:
G Protein-Coupled Receptor (GPCR)
Mol. Mass.:
39690.94
Organism:
Homo sapiens (Human)
Description:
P34972
Residue:
360
  
Inhibitor
Name:
BDBM50432724
Synonyms:
CHEMBL2348465
Type:
Small organic molecule
Emp. Form.:
C28H38O3
Mol. Mass.:
422.5995
SMILES:
CO\C=C/[C@@H]1CC[C@@H]2[C@@H](C1)c1c(O)cc(cc1OC2(C)C)C12CC3CC(CC(C3)C1)C2
: