Target
Cannabinoid receptor 2
Ligand
BDBM50432717
Substrate
Meas. Tech.
ChEMBL_952584 (CHEMBL2354097)
Ki
42±n/a nM
Citation
 Thakur, GABajaj, SParonis, CPeng, YBowman, ALBarak, LSCaron, MGParrish, DDeschamps, JRMakriyannis, A Novel adamantyl cannabinoids as CB1 receptor probes. J Med Chem 56:3904-21 (2013)  
Target
Name:
Cannabinoid receptor 2
Synonyms:
CANNABINOID CB2 CB2 Cannabinoid CB2 receptor Cannabinoid receptor 2 mCB2
Type:
Enzyme Catalytic Domain
Mol. Mass.:
38220.43
Organism:
MOUSE
Description:
P47936
Residue:
347
  
Inhibitor
Name:
BDBM50432717
Synonyms:
CHEMBL2348474
Type:
Small organic molecule
Emp. Form.:
C26H30O2
Mol. Mass.:
374.5152
SMILES:
Cc1ccc2c(c1)-c1c(O)cc(cc1OC2(C)C)C12CC3CC(CC(C3)C1)C2
: