Target
Cannabinoid receptor 1
Ligand
BDBM50432718
Substrate
Meas. Tech.
ChEMBL_952585 (CHEMBL2354098)
Ki
17±n/a nM
Citation
 Thakur, GABajaj, SParonis, CPeng, YBowman, ALBarak, LSCaron, MGParrish, DDeschamps, JRMakriyannis, A Novel adamantyl cannabinoids as CB1 receptor probes. J Med Chem 56:3904-21 (2013)  
Target
Name:
Cannabinoid receptor 1
Synonyms:
Brain-type cannabinoid receptor CB-R CNR1_RAT Cannabinoid receptor Cnr1 | Skr6
Type:
G Protein-Coupled Receptor (GPCR)
Mol. Mass.:
52856.55
Organism:
Rattus norvegicus (rat)
Description:
P20272
Residue:
473
  
Inhibitor
Name:
BDBM50432718
Synonyms:
CHEMBL2348471
Type:
Small organic molecule
Emp. Form.:
C31H42O4
Mol. Mass.:
478.6628
SMILES:
CC(C)(C)C(=O)OCC1=CC[C@@H]2[C@@H](C1)c1c(O)cc(cc1OC2(C)C)C12CC3CC(CC(C3)C1)C2
: