Target
Cannabinoid receptor 1
Ligand
BDBM50432726
Substrate
Meas. Tech.
ChEMBL_952585 (CHEMBL2354098)
Ki
241±n/a nM
Citation
 Thakur, GABajaj, SParonis, CPeng, YBowman, ALBarak, LSCaron, MGParrish, DDeschamps, JRMakriyannis, A Novel adamantyl cannabinoids as CB1 receptor probes. J Med Chem 56:3904-21 (2013)  
Target
Name:
Cannabinoid receptor 1
Synonyms:
Brain-type cannabinoid receptor CB-R CNR1_RAT Cannabinoid receptor Cnr1 | Skr6
Type:
G Protein-Coupled Receptor (GPCR)
Mol. Mass.:
52856.55
Organism:
Rattus norvegicus (rat)
Description:
P20272
Residue:
473
  
Inhibitor
Name:
BDBM50432726
Synonyms:
CHEMBL2348463
Type:
Small organic molecule
Emp. Form.:
C26H35IO2
Mol. Mass.:
506.4594
SMILES:
CC1(C)Oc2cc(cc(O)c2[C@@H]2C[C@H](CI)CC[C@@H]12)C12CC3CC(CC(C3)C1)C2
: