Target
Monoglyceride lipase
Ligand
BDBM60622
Substrate
Meas. Tech.
ChEMBL_956334 (CHEMBL2379568)
IC50
6.0±n/a nM
Citation
 Holtfrerich, AHanekamp, WLehr, M (4-Phenoxyphenyl)tetrazolecarboxamides and related compounds as dual inhibitors of fatty acid amide hydrolase (FAAH) and monoacylglycerol lipase (MAGL). Eur J Med Chem 63:64-75 (2013)  
Target
Name:
Monoglyceride lipase
Synonyms:
MAG lipase Mgll Monoglyceride Lipase (MGL)
Type:
Hydrolase
Mol. Mass.:
33391.67
Organism:
Mus musculus (mouse)
Description:
Assays were using membranes of recombinant MAG Lipase transiently transfected in COS-7 cells.
Residue:
303
  
Inhibitor
Name:
BDBM60622
Synonyms:
BDBM50300355 US9133148, A
Type:
Emp. Form.:
C27H24N2O9
Mol. Mass.:
520.4875
SMILES:
OC(C1CCN(CC1)C(=O)Oc1ccc(cc1)[N+]([O-])=O)(c1ccc2OCOc2c1)c1ccc2OCOc2c1
: