Target
Breakpoint cluster region protein/Tyrosine-protein kinase ABL1
Ligand
BDBM50433232
Substrate
Meas. Tech.
ChEMBL_957284 (CHEMBL2378944)
IC50
4.7±n/a nM
Citation
 Pan, XWang, FZhang, YGao, HHu, ZWang, SZhang, J Design, synthesis and biological activities of Nilotinib derivates as antitumor agents. Bioorg Med Chem 21:2527-34 (2013)  
Target
Name:
Breakpoint cluster region protein/Tyrosine-protein kinase ABL1
Synonyms:
Bcr-Abl Breakpoint cluster region protein /Tyrosine-protein kinase ABL | Tyrosine-protein kinase ABL1/Breakpoint cluster region protein
Type:
Enzyme
Mol. Mass.:
Description:
Components:
This complex has 2 components.
Component 1
Name:
Tyrosine-protein kinase ABL1
Synonyms:
ABL ABL1_HUMAN JTK7 Proto-oncogene tyrosine-protein kinase ABL1 Tyrosine-protein kinase ABL V-abl Abelson murine leukemia viral oncogene homolog 1 p150 | tyrosine-protein kinase ABL1 isoform a
Type:
Enzyme
Mol. Mass.:
122897.30
Organism:
Homo sapiens (Human)
Description:
P00519
Residue:
1130
  
Component 2
Name:
Breakpoint cluster region protein
Synonyms:
BCR BCR_HUMAN Breakpoint cluster region protein | D22S11
Type:
PROTEIN
Mol. Mass.:
142824.75
Organism:
Homo sapiens (Human)
Description:
ChEMBL_305348
Residue:
1271
  
Inhibitor
Name:
BDBM50433232
Synonyms:
CHEMBL2375889
Type:
Small organic molecule
Emp. Form.:
C23H17ClFN5O2
Mol. Mass.:
449.865
SMILES:
COc1ccc(cc1Nc1nccc(n1)-c1cccnc1)C(=O)Nc1ccc(F)c(Cl)c1
: