Target
Tyrosine-protein kinase JAK3
Ligand
BDBM50433240
Substrate
Meas. Tech.
ChEMBL_957633 (CHEMBL2378516)
IC50
0.300000±n/a nM
Citation
 Lynch, SMDeVicente, JHermann, JCJaime-Figueroa, SJin, SKuglstatter, ALi, HLovey, AMenke, JNiu, LPatel, VRoy, DSoth, MSteiner, STivitmahaisoon, PVu, MDYee, C Strategic use of conformational bias and structure based design to identify potent JAK3 inhibitors with improved selectivity against the JAK family and the kinome. Bioorg Med Chem Lett 23:2793-800 (2013)  
Target
Name:
Tyrosine-protein kinase JAK3
Synonyms:
JAK-3 JAK3_HUMAN Janus kinase 3 (JAK3) L-JAK | Leukocyte janus kinase
Type:
Protein
Mol. Mass.:
125111.08
Organism:
Homo sapiens (Human)
Description:
P52333
Residue:
1124
  
Inhibitor
Name:
BDBM50433240
Synonyms:
CHEMBL2376157
Type:
Small organic molecule
Emp. Form.:
C21H17FN8O2
Mol. Mass.:
432.4105
SMILES:
C[C@@H](NC(=O)c1c[nH]c2ncc(nc12)-c1ncn2cc(F)ccc12)C(=O)N1CC(C1)C#N
: