Target
Tyrosine-protein kinase JAK2
Ligand
BDBM50433243
Substrate
Meas. Tech.
ChEMBL_957632 (CHEMBL2378515)
IC50
1.1±n/a nM
Citation
 Lynch, SMDeVicente, JHermann, JCJaime-Figueroa, SJin, SKuglstatter, ALi, HLovey, AMenke, JNiu, LPatel, VRoy, DSoth, MSteiner, STivitmahaisoon, PVu, MDYee, C Strategic use of conformational bias and structure based design to identify potent JAK3 inhibitors with improved selectivity against the JAK family and the kinome. Bioorg Med Chem Lett 23:2793-800 (2013)  
Target
Name:
Tyrosine-protein kinase JAK2
Synonyms:
JAK-2 JAK2_HUMAN Janus kinase 2 (JAK2) | Janus kinase 2 (a protein tyrosine kinase)
Type:
Protein
Mol. Mass.:
130684.68
Organism:
Homo sapiens (Human)
Description:
O60674
Residue:
1132
  
Inhibitor
Name:
BDBM50433243
Synonyms:
CHEMBL2376154
Type:
Small organic molecule
Emp. Form.:
C24H21ClN8O2
Mol. Mass.:
488.929
SMILES:
Cn1nc(-c2cnc3[nH]cc(C(=O)N[C@H](C4CC4)C(=O)N4CC(C4)C#N)c3n2)c2ccc(Cl)cc12
: