Target
Tyrosine-protein kinase JAK2
Ligand
BDBM50433252
Substrate
Meas. Tech.
ChEMBL_957632 (CHEMBL2378515)
IC50
22±n/a nM
Citation
 Lynch, SMDeVicente, JHermann, JCJaime-Figueroa, SJin, SKuglstatter, ALi, HLovey, AMenke, JNiu, LPatel, VRoy, DSoth, MSteiner, STivitmahaisoon, PVu, MDYee, C Strategic use of conformational bias and structure based design to identify potent JAK3 inhibitors with improved selectivity against the JAK family and the kinome. Bioorg Med Chem Lett 23:2793-800 (2013)  
Target
Name:
Tyrosine-protein kinase JAK2
Synonyms:
JAK-2 JAK2_HUMAN Janus kinase 2 (JAK2) | Janus kinase 2 (a protein tyrosine kinase)
Type:
Protein
Mol. Mass.:
130684.68
Organism:
Homo sapiens (Human)
Description:
O60674
Residue:
1132
  
Inhibitor
Name:
BDBM50433252
Synonyms:
CHEMBL2376144
Type:
Small organic molecule
Emp. Form.:
C22H19ClN8O2
Mol. Mass.:
462.892
SMILES:
C[C@@H](NC(=O)c1c[nH]c2ncc(nc12)-c1nn(C)c2cc(Cl)ccc12)C(=O)N1CC(C1)C#N
: