Target
Alpha-1,6-mannosyl-glycoprotein 2-beta-N-acetylglucosaminyltransferase
Ligand
BDBM50433273
Substrate
Meas. Tech.
ChEMBL_957856 (CHEMBL2378969)
IC50
158±n/a nM
Citation
 Barlind, JGBuckett, LKCrosby, SGDavidsson, ÖEmtenäs, HErtan, AJurva, ULemurell, MGutierrez, PMNilsson, KO'Mahony, GPetersson, AURedzic, AWågberg, FYuan, ZQ Identification and design of a novel series of MGAT2 inhibitors. Bioorg Med Chem Lett 23:2721-6 (2013)  
Target
Name:
Alpha-1,6-mannosyl-glycoprotein 2-beta-N-acetylglucosaminyltransferase
Synonyms:
Beta-1,2-N-acetylglucosaminyltransferase II GlcNAc-T II Mannoside acetylglucosaminyltransferase 2 N-glycosyl-oligosaccharide-glycoprotein N-acetylglucosaminyltransferase II
Type:
PROTEIN
Mol. Mass.:
51045.37
Organism:
Mus musculus
Description:
ChEMBL_107583
Residue:
442
  
Inhibitor
Name:
BDBM50433273
Synonyms:
CHEMBL2376322
Type:
Small organic molecule
Emp. Form.:
C18H19N3O4S
Mol. Mass.:
373.426
SMILES:
CCC1(C)NC(=O)c2cc(ccc2NC1=O)S(=O)(=O)Nc1ccccc1
: