Target
Diacylglycerol O-acyltransferase 2
Ligand
BDBM50433279
Substrate
Meas. Tech.
ChEMBL_957844 (CHEMBL2378957)
IC50
>10000±n/a nM
Citation
 Barlind, JGBuckett, LKCrosby, SGDavidsson, ÖEmtenäs, HErtan, AJurva, ULemurell, MGutierrez, PMNilsson, KO'Mahony, GPetersson, AURedzic, AWågberg, FYuan, ZQ Identification and design of a novel series of MGAT2 inhibitors. Bioorg Med Chem Lett 23:2721-6 (2013)  
Target
Name:
Diacylglycerol O-acyltransferase 2
Synonyms:
ARAT DGAT2 Diacylglycerol O-acyltransferase 2 (DGAT2) Retinol O-fatty-acyltransferase
Type:
Multi-pass membrane protein
Mol. Mass.:
43848.90
Organism:
Homo sapiens (Human)
Description:
Q96PD7
Residue:
388
  
Inhibitor
Name:
BDBM50433279
Synonyms:
CHEMBL2376311
Type:
Small organic molecule
Emp. Form.:
C19H21N3O4S
Mol. Mass.:
387.453
SMILES:
CCC1(C)NC(=O)c2cc(ccc2NC1=O)S(=O)(=O)N(C)c1ccccc1
: