Target
D-amino-acid oxidase
Ligand
BDBM50004955
Substrate
Meas. Tech.
ChEMBL_957005 (CHEMBL2378387)
Ki
3400±n/a nM
Citation
 Hopkins, SCHeffernan, MLSaraswat, LDBowen, CAMelnick, LHardy, LWOrsini, MAAllen, MSKoch, PSpear, KLFoglesong, RJSoukri, MChytil, MFang, QKJones, SWVarney, MAPanatier, AOliet, SHPollegioni, LPiubelli, LMolla, GNardini, MLarge, TH Structural, kinetic, and pharmacodynamic mechanisms of D-amino acid oxidase inhibition by small molecules. J Med Chem 56:3710-24 (2013)  
Target
Name:
D-amino-acid oxidase
Synonyms:
D-Amino Acid Oxidase (DAAO) DAMOX OXDA_PIG
Type:
Flavoprotein
Mol. Mass.:
39338.01
Organism:
Sus scrofa (pig)
Description:
Homodimer.
Residue:
347
  
Inhibitor
Name:
BDBM50004955
Synonyms:
1H-Indole-2-carboxylic acid Indol-2-carboxylic acid | Indole-2-carboxylate
Type:
Small organic molecule
Emp. Form.:
C9H7NO2
Mol. Mass.:
161.1574
SMILES:
OC(=O)c1cc2ccccc2[nH]1
: