Target
D-amino-acid oxidase
Ligand
BDBM50260725
Substrate
Meas. Tech.
ChEMBL_957000 (CHEMBL2378382)
Ki
3.5±n/a nM
Citation
 Hopkins, SCHeffernan, MLSaraswat, LDBowen, CAMelnick, LHardy, LWOrsini, MAAllen, MSKoch, PSpear, KLFoglesong, RJSoukri, MChytil, MFang, QKJones, SWVarney, MAPanatier, AOliet, SHPollegioni, LPiubelli, LMolla, GNardini, MLarge, TH Structural, kinetic, and pharmacodynamic mechanisms of D-amino acid oxidase inhibition by small molecules. J Med Chem 56:3710-24 (2013)  
Target
Name:
D-amino-acid oxidase
Synonyms:
D-amino-acid oxidase (DAAO) DAMOX OXDA_HUMAN
Type:
Homodimer
Mol. Mass.:
39476.06
Organism:
Homo sapiens (Human)
Description:
P14920
Residue:
347
  
Inhibitor
Name:
BDBM50260725
Synonyms:
4H-thieno[3,2-b]pyrrole-5-carboxylic acid | CHEMBL507614
Type:
Small organic molecule
Emp. Form.:
C7H5NO2S
Mol. Mass.:
167.185
SMILES:
OC(=O)c1cc2sccc2[nH]1
: