Target
Methionine aminopeptidase 1
Ligand
BDBM50433398
Substrate
Meas. Tech.
ChEMBL_957177 (CHEMBL2378715)
EC50
5000±n/a nM
Citation
 Zhang, FBhat, SGabelli, SBChen, XMiller, MSNacev, BACheng, YLMeyers, DJTenney, KShim, JSCrews, PAmzel, LMMa, DLiu, JO Pyridinylquinazolines selectively inhibit human methionine aminopeptidase-1 in cells. J Med Chem 56:3996-4016 (2013)  
Target
Name:
Methionine aminopeptidase 1
Synonyms:
Aminopeptidase MAP 1 METAP1 Methionine Aminopeptidase Type 1 (MetAP1) | Peptidase M 1
Type:
Enzyme
Mol. Mass.:
43220.79
Organism:
Homo sapiens (Human)
Description:
MetAP1 with an N-terminal six histidine tag was expressed in baculovirus infected sf9 cells.
Residue:
386
  
Inhibitor
Name:
BDBM50433398
Synonyms:
CHEMBL2375607
Type:
Small organic molecule
Emp. Form.:
C24H20Cl2N4
Mol. Mass.:
435.348
SMILES:
Clc1ccc(cc1Cl)N1CCN(CC1)c1cc(nc2ccccc12)-c1ccccn1
: