Target
Endothelial lipase
Ligand
BDBM50433472
Substrate
Meas. Tech.
ChEMBL_959457 (CHEMBL2384495)
IC50
680±n/a nM
Citation
 Greco, MNConnelly, MALeo, GCOlson, MWPowell, EHuang, ZHawkins, MSmith, CSchalk-Hihi, CDarrow, ALXin, HLang, WDamiano, BPHlasta, DJ A thiocarbamate inhibitor of endothelial lipase raises HDL cholesterol levels in mice. Bioorg Med Chem Lett 23:2595-7 (2013)  
Target
Name:
Endothelial lipase
Synonyms:
EDL Endothelial lipase LIPE_MOUSE | Lipg
Type:
Protein
Mol. Mass.:
56643.58
Organism:
Mus musculus (Mouse)
Description:
Q9WVG5
Residue:
500
  
Inhibitor
Name:
BDBM50433472
Synonyms:
CHEMBL2381069
Type:
Small organic molecule
Emp. Form.:
C20H24FNOS
Mol. Mass.:
345.474
SMILES:
Fc1ccccc1CSC(=O)NCCCCCCc1ccccc1
: