Target
Aurora kinase A
Ligand
BDBM50433638
Substrate
Meas. Tech.
ChEMBL_959028 (CHEMBL2382841)
IC50
4.0±n/a nM
Citation
 Karra, SXiao, YChen, XLiu-Bujalski, LHuck, BSutton, AGoutopoulos, AAskew, BJosephson, KJiang, XShutes, AShankar, VNoonan, TGarcia-Berrios, GDong, RDhanabal, MTian, HWang, ZClark, AGoodstal, S SAR and evaluation of novel 5H-benzo[c][1,8]naphthyridin-6-one analogs as Aurora kinase inhibitors. Bioorg Med Chem Lett 23:3081-7 (2013)  
Target
Name:
Aurora kinase A
Synonyms:
AIK ARK1 AURKA AYK1 Aurora kinase A (AURA) Aurora kinase A (Aurora A) Aurora-related kinase 1 BTAK Breast-tumor-amplified kinase STK15 Serine/threonine kinase 15 Serine/threonine-protein kinase aurora A hARK1
Type:
Serine/threonine-protein kinase
Mol. Mass.:
45830.98
Organism:
Homo sapiens (Human)
Description:
O14965
Residue:
403
  
Inhibitor
Name:
BDBM50433638
Synonyms:
CHEMBL2380827
Type:
Small organic molecule
Emp. Form.:
C25H17FN4O2
Mol. Mass.:
424.4265
SMILES:
Fc1ccc(cc1)C(=O)Nc1ccc(Nc2ccnc3[nH]c(=O)c4ccccc4c23)cc1
: