Target
L-lactate dehydrogenase B chain
Ligand
BDBM50433836
Substrate
Meas. Tech.
ChEMBL_959387 (CHEMBL2384178)
IC50
11100±n/a nM
Citation
 Dragovich, PSFauber, BPCorson, LBDing, CZEigenbrot, CGe, HGiannetti, AMHunsaker, TLabadie, SLiu, YMalek, SPan, BPeterson, DPitts, KPurkey, HESideris, SUltsch, MVanderPorten, EWei, BXu, QYen, IYue, QZhang, HZhang, X Identification of substituted 2-thio-6-oxo-1,6-dihydropyrimidines as inhibitors of human lactate dehydrogenase. Bioorg Med Chem Lett 23:3186-94 (2013)  
Target
Name:
L-lactate dehydrogenase B chain
Synonyms:
L-lactate dehydrogenase B LDH heart subunit LDH-H LDHB_HUMAN Renal carcinoma antigen NY-REN-46
Type:
Oxidoreductase; homotetramer
Mol. Mass.:
36635.55
Organism:
Homo sapiens (Human)
Description:
Residue:
334
  
Inhibitor
Name:
BDBM50433836
Synonyms:
CHEMBL2382337
Type:
Small organic molecule
Emp. Form.:
C19H14ClN5O4S2
Mol. Mass.:
475.929
SMILES:
NS(=O)(=O)c1ccc(NC(=O)CSc2nc(-c3ccc(Cl)cc3)c(C#N)c(=O)[nH]2)cc1
: