Target
Glucose-dependent insulinotropic receptor
Ligand
BDBM50433857
Substrate
Meas. Tech.
ChEMBL_959598 (CHEMBL2382543)
IC50
4.0±n/a nM
Citation
 Scott, JSBrocklehurst, KJBrown, HSClarke, DSCoe, HGroombridge, SDLaber, DMacFaul, PAMcKerrecher, DSchofield, P Conformational restriction in a series of GPR119 agonists: differences in pharmacology between mouse and human. Bioorg Med Chem Lett 23:3175-9 (2013)  
Target
Name:
Glucose-dependent insulinotropic receptor
Synonyms:
G-protein coupled receptor 119 (GPR119) GPR119 | Glucose-dependent insulinotropic receptor
Type:
Protein
Mol. Mass.:
36901.49
Organism:
Homo sapiens (Human)
Description:
Q8TDV5
Residue:
335
  
Inhibitor
Name:
BDBM50433857
Synonyms:
CHEMBL2382417
Type:
Small organic molecule
Emp. Form.:
C22H24N8O2
Mol. Mass.:
432.4784
SMILES:
CC(C)c1nc(no1)N1C2CCC1CN(C2)c1ncc(OCc2ccncc2C#N)cn1
: