Target
Steroid hormone receptor ERR1
Ligand
BDBM7462
Substrate
Meas. Tech.
ChEMBL_958431 (CHEMBL2382939)
IC50
9640±n/a nM
Citation
 Xu, SZhuang, XPan, XZhang, ZDuan, LLiu, YZhang, LRen, XDing, K 1-Phenyl-4-benzoyl-1H-1,2,3-triazoles as orally bioavailable transcriptional function suppressors of estrogen-related receptora. J Med Chem 56:4631-40 (2013)  
Target
Name:
Steroid hormone receptor ERR1
Synonyms:
ERR-alpha ERR1_HUMAN ESRRA Estrogen-Related Receptor, alpha NR3B1 Steroid hormone receptor ERR1 Steroid hormone receptor ERR1/Estrogen-related receptor alpha (ERRa) | von Hippel-Lindau disease tumor suppressor/Steroid hormone receptor ERR1
Type:
PROTEIN
Mol. Mass.:
45508.08
Organism:
Homo sapiens (Human)
Description:
ChEMBL_1499891
Residue:
423
  
Inhibitor
Name:
BDBM7462
Synonyms:
3,5,7-trihydroxy-2-(4-hydroxyphenyl)-4H-chromen-4-one CHEMBL150 Kaempferol (Kmp) kaempferol
Type:
Small organic molecule
Emp. Form.:
C15H10O6
Mol. Mass.:
286.2363
SMILES:
Oc1ccc(cc1)-c1oc2cc(O)cc(O)c2c(=O)c1O
: