Target
Sialidase-4
Ligand
BDBM50331682
Substrate
Meas. Tech.
ChEMBL_960637 (CHEMBL2390090)
IC50
4500±n/a nM
Citation
 Albohy, AZhang, YSmutova, VPshezhetsky, AVCairo, CW Identification of Selective Nanomolar Inhibitors of the Human Neuraminidase, NEU4. ACS Med Chem Lett 4:532-7 (2013)  
Target
Name:
Sialidase-4
Synonyms:
NEU4 Sialidase 4
Type:
PROTEIN
Mol. Mass.:
51579.82
Organism:
Homo sapiens (Human)
Description:
ChEMBL_960637
Residue:
484
  
Inhibitor
Name:
BDBM50331682
Synonyms:
(2R,3R,4S)-3-(2-azidoacetamido)-4-hydroxy-2-((1R,2R)-1,2,3-trihydroxypropyl)-3,4-dihydro-2H-pyran-6-carboxylate | CHEMBL1289862
Type:
Small organic molecule
Emp. Form.:
C11H16N4O8
Mol. Mass.:
332.2667
SMILES:
OC[C@@H](O)[C@@H](O)[C@@H]1OC(=C[C@H](O)[C@H]1NC(=O)CN=[N+]=[N-])C(O)=O
: