Target
Dual specificity tyrosine-phosphorylation-regulated kinase 1B
Ligand
BDBM50434348
Substrate
Meas. Tech.
ChEMBL_961004 (CHEMBL2388920)
IC50
11±n/a nM
Citation
 Rosse, G Tricyclic Pyrimidines As Inhibitors of DYRK1A/DYRK1B As Potential Treatment for Down's Syndrome or Alzheimer's Disease. ACS Med Chem Lett 4:502-3 (2013)  
Target
Name:
Dual specificity tyrosine-phosphorylation-regulated kinase 1B
Synonyms:
DYR1B_HUMAN Dual specificity tyrosine-phosphorylation-regulated kinase 1B MIRK
Type:
Enzyme
Mol. Mass.:
69222.24
Organism:
Homo sapiens (Human)
Description:
Q9Y463
Residue:
629
  
Inhibitor
Name:
BDBM50434348
Synonyms:
CHEMBL2386752 | US9446044, 79
Type:
Small organic molecule
Emp. Form.:
C17H12FN5O2S
Mol. Mass.:
369.373
SMILES:
COC(=N)c1nc2ccc3ncnc(Nc4ccc(O)c(F)c4)c3c2s1
: