Target
Microtubule-associated protein tau
Ligand
BDBM50434482
Substrate
Meas. Tech.
ChEMBL_961459 (CHEMBL2388171)
Kd
2360±n/a nM
Citation
 Matsumura, KOno, MYoshimura, MKimura, HWatanabe, HOkamoto, YIhara, MTakahashi, RSaji, H Synthesis and biological evaluation of novel styryl benzimidazole derivatives as probes for imaging of neurofibrillary tangles in Alzheimer's disease. Bioorg Med Chem 21:3356-62 (2013)  
Target
Name:
Microtubule-associated protein tau
Synonyms:
MAPT MTBT1 Neurofibrillary tangle protein Paired helical filament-tau TAU_HUMAN | Tau Protein
Type:
Protein
Mol. Mass.:
78928.63
Organism:
Homo sapiens (Human)
Description:
P10636
Residue:
758
  
Inhibitor
Name:
BDBM50434482
Synonyms:
CHEMBL2385163
Type:
Small organic molecule
Emp. Form.:
C15H12IN3
Mol. Mass.:
361.1804
SMILES:
Nc1ccc(C=Cc2nc3ccc(I)cc3[nH]2)cc1
: