Target
TGF-beta receptor type-1
Ligand
BDBM50434750
Substrate
Meas. Tech.
ChEMBL_961930 (CHEMBL2390521)
IC50
75±n/a nM
Citation
 Engers, DWFrist, AYLindsley, CWHong, CCHopkins, CR Synthesis and structure-activity relationships of a novel and selective bone morphogenetic protein receptor (BMP) inhibitor derived from the pyrazolo[1.5-a]pyrimidine scaffold of dorsomorphin: the discovery of ML347 as an ALK2 versus ALK3 selective MLPCN probe. Bioorg Med Chem Lett 23:3248-52 (2013)  
Target
Name:
TGF-beta receptor type-1
Synonyms:
ALK-5 Activin A receptor type II-like protein kinase of 53kD SKR4 TGF-beta receptor type I TGFBR1 TGFR1_HUMAN Transforming growth factor-beta receptor type I
Type:
enzyme
Mol. Mass.:
55968.24
Organism:
Homo sapiens (Human)
Description:
P36897
Residue:
503
  
Inhibitor
Name:
BDBM50434750
Synonyms:
CHEMBL2385596
Type:
Small organic molecule
Emp. Form.:
C26H24N6
Mol. Mass.:
420.509
SMILES:
CN1CCN(CC1)c1ccc(cc1)-c1cnc2c(cnn2c1)-c1ccnc2ccccc12
: