Target
Bone morphogenetic protein receptor type-2
Ligand
BDBM50262079
Substrate
Meas. Tech.
ChEMBL_961929 (CHEMBL2390520)
IC50
3845±n/a nM
Citation
 Engers, DWFrist, AYLindsley, CWHong, CCHopkins, CR Synthesis and structure-activity relationships of a novel and selective bone morphogenetic protein receptor (BMP) inhibitor derived from the pyrazolo[1.5-a]pyrimidine scaffold of dorsomorphin: the discovery of ML347 as an ALK2 versus ALK3 selective MLPCN probe. Bioorg Med Chem Lett 23:3248-52 (2013)  
Target
Name:
Bone morphogenetic protein receptor type-2
Synonyms:
BMPR2 Bone Morphogenetic Protein Receptor type II (BMPR2) PPH1
Type:
PROTEIN
Mol. Mass.:
115194.11
Organism:
Homo sapiens (Human)
Description:
ChEMBL_774306
Residue:
1038
  
Inhibitor
Name:
BDBM50262079
Synonyms:
4-(6-(4-(piperazin-1-yl)phenyl)pyrazolo[1,5-a]pyrimidin-3-yl)quinoline CHEMBL513147 | LDN-193189
Type:
Small organic molecule
Emp. Form.:
C25H22N6
Mol. Mass.:
406.4824
SMILES:
C1CN(CCN1)c1ccc(cc1)-c1cnc2c(cnn2c1)-c1ccnc2ccccc12
: