Target
Proteasome subunit beta type-1
Ligand
BDBM50434767
Substrate
Meas. Tech.
ChEMBL_962204 (CHEMBL2388792)
Ki
4420±n/a nM
Citation
 Micale, NEttari, RLavecchia, ADi Giovanni, CScarbaci, KTroiano, VGrasso, SNovellino, ESchirmeister, TZappalà, M Development of peptidomimetic boronates as proteasome inhibitors. Eur J Med Chem 64:23-34 (2013)  
Target
Name:
Proteasome subunit beta type-1
Synonyms:
PSB1_HUMAN PSMB1 Proteasome subunit beta type-1/beta type-5
Type:
PROTEIN
Mol. Mass.:
26493.62
Organism:
Homo sapiens (Human)
Description:
ChEMBL_1366691
Residue:
241
  
Inhibitor
Name:
BDBM50434767
Synonyms:
CHEMBL2385811
Type:
Small organic molecule
Emp. Form.:
C16H28BN3O4
Mol. Mass.:
337.222
SMILES:
CCN(CC)c1ccn(CC(=O)N[C@@H](CC(C)C)B(O)O)c(=O)c1
: