Target
Tyrosine-protein kinase JAK2
Ligand
BDBM50193995
Substrate
Meas. Tech.
ChEMBL_962509 (CHEMBL2390551)
Ki
0.700000±n/a nM
Citation
 Zak, MHurley, CAWard, SIBergeron, PBarrett, KBalazs, MBlair, WSBull, RChakravarty, PChang, CCrackett, PDeshmukh, GDeVoss, JDragovich, PSEigenbrot, CEllwood, CGaines, SGhilardi, NGibbons, PGradl, SGribling, PHamman, CHarstad, EHewitt, PJohnson, AJohnson, TKenny, JRKoehler, MFBir Kohli, PLabadie, SLee, WPLiao, JLiimatta, MMendonca, RNarukulla, RPulk, RReeve, ASavage, SShia, SSteffek, MUbhayakar, Svan Abbema, AAliagas, IAvitabile-Woo, BXiao, YYang, JKulagowski, JJ Identification of C-2 hydroxyethyl imidazopyrrolopyridines as potent JAK1 inhibitors with favorable physicochemical properties and high selectivity over JAK2. J Med Chem 56:4764-85 (2013)  
Target
Name:
Tyrosine-protein kinase JAK2
Synonyms:
JAK-2 JAK2_HUMAN Janus kinase 2 (JAK2) | Janus kinase 2 (a protein tyrosine kinase)
Type:
Protein
Mol. Mass.:
130684.68
Organism:
Homo sapiens (Human)
Description:
O60674
Residue:
1132
  
Inhibitor
Name:
BDBM50193995
Synonyms:
3-((3R,4R)-4-methyl-3-(methyl(7H-pyrrolo[2,3-d]pyrimidin-4-yl)amino)piperidin-1-yl)-3-oxopropanenitrile 3-{(3R,4R)-4-methyl-3-[methyl(7H-pyrrolo[2,3-d]pyrimidin-4-yl)amino]piperidin-1-yl}-3-oxopropanenitrile CP-690550 Tofacitinib US10112907, Example 00035 US10766894, Compound TABLE 1.20 US11078206, Example Tofacitinib US11339167, Example Tofacitinib
Type:
Small organic molecule
Emp. Form.:
C16H20N6O
Mol. Mass.:
312.3696
SMILES:
C[C@@H]1CCN(C[C@@H]1N(C)c1ncnc2[nH]ccc12)C(=O)CC#N
: