Target
Tyrosine-protein kinase JAK3
Ligand
BDBM50193995
Substrate
Meas. Tech.
ChEMBL_962891 (CHEMBL2389439)
Ki
0.400000±n/a nM
Citation
 Liang, Jvan Abbema, ABalazs, MBarrett, KBerezhkovsky, LBlair, WChang, CDelarosa, DDeVoss, JDriscoll, JEigenbrot, CGhilardi, NGibbons, PHalladay, JJohnson, AKohli, PBLai, YLiu, YLyssikatos, JMantik, PMenghrajani, KMurray, JPeng, ISambrone, AShia, SShin, YSmith, JSohn, STsui, VUltsch, MWu, LCXiao, YYang, WYoung, JZhang, BZhu, BYMagnuson, S Lead optimization of a 4-aminopyridine benzamide scaffold to identify potent, selective, and orally bioavailable TYK2 inhibitors. J Med Chem 56:4521-36 (2013)  
Target
Name:
Tyrosine-protein kinase JAK3
Synonyms:
JAK-3 JAK3_HUMAN Janus kinase 3 (JAK3) L-JAK | Leukocyte janus kinase
Type:
Protein
Mol. Mass.:
125111.08
Organism:
Homo sapiens (Human)
Description:
P52333
Residue:
1124
  
Inhibitor
Name:
BDBM50193995
Synonyms:
3-((3R,4R)-4-methyl-3-(methyl(7H-pyrrolo[2,3-d]pyrimidin-4-yl)amino)piperidin-1-yl)-3-oxopropanenitrile 3-{(3R,4R)-4-methyl-3-[methyl(7H-pyrrolo[2,3-d]pyrimidin-4-yl)amino]piperidin-1-yl}-3-oxopropanenitrile CP-690550 Tofacitinib US10112907, Example 00035 US10766894, Compound TABLE 1.20 US11078206, Example Tofacitinib US11339167, Example Tofacitinib
Type:
Small organic molecule
Emp. Form.:
C16H20N6O
Mol. Mass.:
312.3696
SMILES:
C[C@@H]1CCN(C[C@@H]1N(C)c1ncnc2[nH]ccc12)C(=O)CC#N
: