Target
Low molecular weight phosphotyrosine protein phosphatase
Ligand
BDBM50436358
Substrate
Meas. Tech.
ChEMBL_966888 (CHEMBL2401179)
IC50
340±n/a nM
Citation
 He, YLiu, SMenon, AStanford, SOppong, EGunawan, AMWu, LWu, DJBarrios, AMBottini, NCato, ACZhang, ZY A potent and selective small-molecule inhibitor for the lymphoid-specific tyrosine phosphatase (LYP), a target associated with autoimmune diseases. J Med Chem 56:4990-5008 (2013)  
Target
Name:
Low molecular weight phosphotyrosine protein phosphatase
Synonyms:
3.1.3.2 ACP1 LMW-PTP LMWPTP PPAC_HUMAN low molecular weight phosphotyrosine protein phosphatase isoform c
Type:
Mol. Mass.:
18042.81
Organism:
Homo sapiens (Human)
Description:
P24666
Residue:
158
  
Inhibitor
Name:
BDBM50436358
Synonyms:
CHEMBL2396718
Type:
Small organic molecule
Emp. Form.:
C28H22ClNO6
Mol. Mass.:
503.93
SMILES:
CCCNC(=O)COc1ccc(cc1)-c1oc2cc(O)c(cc2c1C#Cc1cccc(Cl)c1)C(O)=O
: