Target
Type 1 fimbrin D-mannose specific adhesin
Ligand
BDBM50347460
Substrate
Meas. Tech.
ChEMBL_966537 (CHEMBL2399353)
Kd
5.0±n/a nM
Citation
 Brument, SSivignon, ADumych, TIMoreau, NRoos, GGuérardel, YChalopin, TDeniaud, DBilyy, RODarfeuille-Michaud, ABouckaert, JGouin, SG Thiazolylaminomannosides as potent antiadhesives of type 1 piliated Escherichia coli isolated from Crohn's disease patients. J Med Chem 56:5395-406 (2014)  
Target
Name:
Type 1 fimbrin D-mannose specific adhesin
Synonyms:
Adhesin protein fimH fimH
Type:
PROTEIN
Mol. Mass.:
31474.61
Organism:
Escherichia coli (strain K12)
Description:
ChEMBL_1298296
Residue:
300
  
Inhibitor
Name:
BDBM50347460
Synonyms:
CHEMBL1170455
Type:
Small organic molecule
Emp. Form.:
C13H26O6
Mol. Mass.:
278.3419
SMILES:
CCCCCCCOC1OC(CO)C(O)C(O)C1O
: