Target
Enoyl-[acyl-carrier-protein] reductase [NADH]
Ligand
BDBM8726
Substrate
Meas. Tech.
ChEMBL_966861 (CHEMBL2401005)
IC50
1300±n/a nM
Citation
 Hu, XCompton, JRAbdulhameed, MDMarchand, CLRobertson, KLLeary, DHJadhav, AHershfield, JRWallqvist, AFriedlander, AMLegler, PM 3-substituted indole inhibitors against Francisella tularensis FabI identified by structure-based virtual screening. J Med Chem 56:5275-87 (2014)  
Target
Name:
Enoyl-[acyl-carrier-protein] reductase [NADH]
Synonyms:
fabI
Type:
PROTEIN
Mol. Mass.:
27804.42
Organism:
Francisella tularensis subsp. tularensis (strain SCHU S4 / Schu 4)
Description:
Q5NGQ3
Residue:
260
  
Inhibitor
Name:
BDBM8726
Synonyms:
5-chloro-2-(2,4-dichlorophenoxy)phenol TCL US20230414581, Compound 35
Type:
Small organic molecule
Emp. Form.:
C12H7Cl3O2
Mol. Mass.:
289.542
SMILES:
Oc1cc(Cl)ccc1Oc1ccc(Cl)cc1Cl
: