Target
E3 ubiquitin-protein ligase XIAP
Ligand
BDBM50436879
Substrate
Meas. Tech.
ChEMBL_971509 (CHEMBL2406571)
Ki
2430±n/a nM
Citation
 Ardecky, RJWelsh, KFinlay, DLee, PSGonzález-López, MGanji, SRRavanan, PMace, PDRiedl, SJVuori, KReed, JCCosford, ND Design, synthesis and evaluation of inhibitor of apoptosis protein (IAP) antagonists that are highly selective for the BIR2 domain of XIAP. Bioorg Med Chem Lett 23:4253-7 (2013)  
Target
Name:
E3 ubiquitin-protein ligase XIAP
Synonyms:
API3 E3 ubiquitin-protein ligase XIAP Inhibitor of apoptosis protein 3 X-linked inhibitor of apoptosis XIAP | XIAP_HUMAN
Type:
Protein
Mol. Mass.:
56685.27
Organism:
Homo sapiens (Human)
Description:
P98170
Residue:
497
  
Inhibitor
Name:
BDBM50436879
Synonyms:
CHEMBL2401766
Type:
Small organic molecule
Emp. Form.:
C21H28N4O4
Mol. Mass.:
400.4714
SMILES:
CC(C)[C@H](NC(=O)[C@@H](N)CO)C(=O)N[C@@H](C)C(=O)Nc1cccc2ccccc12
: