Target
E3 ubiquitin-protein ligase XIAP
Ligand
BDBM44288
Substrate
Meas. Tech.
ChEMBL_971509 (CHEMBL2406571)
Ki
2380±n/a nM
Citation
 Ardecky, RJWelsh, KFinlay, DLee, PSGonzález-López, MGanji, SRRavanan, PMace, PDRiedl, SJVuori, KReed, JCCosford, ND Design, synthesis and evaluation of inhibitor of apoptosis protein (IAP) antagonists that are highly selective for the BIR2 domain of XIAP. Bioorg Med Chem Lett 23:4253-7 (2013)  
Target
Name:
E3 ubiquitin-protein ligase XIAP
Synonyms:
API3 E3 ubiquitin-protein ligase XIAP Inhibitor of apoptosis protein 3 X-linked inhibitor of apoptosis XIAP | XIAP_HUMAN
Type:
Protein
Mol. Mass.:
56685.27
Organism:
Homo sapiens (Human)
Description:
P98170
Residue:
497
  
Inhibitor
Name:
BDBM44288
Synonyms:
(2S)-N-[(1S)-1-[(3-fluoroanilino)carbamoyl]-2-methyl-propyl]-3-methyl-2-[[(2S)-2-(methylamino)propanoyl]amino]butyramide;formic acid (2S)-N-[(2S)-1-[2-(3-fluorophenyl)hydrazinyl]-3-methyl-1-oxidanylidene-butan-2-yl]-3-methyl-2-[[(2S)-2-(methylamino)propanoyl]amino]butanamide;methanoic acid CHEMBL1619873 cid_44176344
Type:
Small organic molecule
Emp. Form.:
C20H32FN5O3
Mol. Mass.:
409.4982
SMILES:
CN[C@@H](C)C(=O)N[C@@H](C(C)C)C(=O)N[C@@H](C(C)C)C(=O)NNc1cccc(F)c1
: