Target
E3 ubiquitin-protein ligase XIAP
Ligand
BDBM50436890
Substrate
Meas. Tech.
ChEMBL_971509 (CHEMBL2406571)
Ki
4360±n/a nM
Citation
 Ardecky, RJWelsh, KFinlay, DLee, PSGonzález-López, MGanji, SRRavanan, PMace, PDRiedl, SJVuori, KReed, JCCosford, ND Design, synthesis and evaluation of inhibitor of apoptosis protein (IAP) antagonists that are highly selective for the BIR2 domain of XIAP. Bioorg Med Chem Lett 23:4253-7 (2013)  
Target
Name:
E3 ubiquitin-protein ligase XIAP
Synonyms:
API3 E3 ubiquitin-protein ligase XIAP Inhibitor of apoptosis protein 3 X-linked inhibitor of apoptosis XIAP | XIAP_HUMAN
Type:
Protein
Mol. Mass.:
56685.27
Organism:
Homo sapiens (Human)
Description:
P98170
Residue:
497
  
Inhibitor
Name:
BDBM50436890
Synonyms:
CHEMBL2401762
Type:
Small organic molecule
Emp. Form.:
C24H39N5O3
Mol. Mass.:
445.5982
SMILES:
CN[C@@H](C)C(=O)N[C@@H](C(C)C)C(=O)N[C@@H](CCCN)C(=O)N[C@@H]1CCCc2ccccc12
: