Target
Neuropeptide Y receptor type 2
Ligand
BDBM50437008
Substrate
Meas. Tech.
ChEMBL_971723 (CHEMBL2404392)
Kd
2.0±n/a nM
Citation
 Chai, WWong, VDNepomuceno, DBonaventure, PLovenberg, TWCarruthers, NI The discovery of potent selective NPY Y(2) antagonists. Bioorg Med Chem Lett 23:4141-4 (2013)  
Target
Name:
Neuropeptide Y receptor type 2
Synonyms:
NPY-Y2 NPY2-R NPY2R_HUMAN Y2 receptor | neuropeptide Y receptor Y2
Type:
Enzyme Catalytic Domain
Mol. Mass.:
42734.65
Organism:
Homo sapiens (Human)
Description:
NPY-Y2 NPY2R HUMAN::P49146
Residue:
381
  
Inhibitor
Name:
BDBM50437008
Synonyms:
CHEMBL2403028
Type:
Small organic molecule
Emp. Form.:
C29H36FN5O3
Mol. Mass.:
521.6262
SMILES:
CCN(CC)C(=O)C(C1CCN(CC1)c1ccc(NC(=O)Nc2c(C)noc2C)cc1F)c1ccccc1
: