Target
Adenosine receptor A1
Ligand
BDBM50437188
Substrate
Meas. Tech.
ChEMBL_969854 (CHEMBL2404654)
Ki
35±n/a nM
Citation
 Paoletta, STosh, DKFinley, AGizewski, ETMoss, SMGao, ZGAuchampach, JASalvemini, DJacobson, KA Rational design of sulfonated A3 adenosine receptor-selective nucleosides as pharmacological tools to study chronic neuropathic pain. J Med Chem 56:5949-63 (2014)  
Target
Name:
Adenosine receptor A1
Synonyms:
AA1R_MOUSE Adenosine receptor A1 | Adora1
Type:
PROTEIN
Mol. Mass.:
36646.06
Organism:
Mus musculus
Description:
ChEMBL_479902
Residue:
326
  
Inhibitor
Name:
BDBM50437188
Synonyms:
CHEMBL2401954
Type:
Small organic molecule
Emp. Form.:
C28H25ClN6O6S
Mol. Mass.:
609.053
SMILES:
CNC(=O)[C@@]12C[C@@H]1[C@H]([C@H](O)[C@@H]2O)n1cnc2c(NCc3cccc(Cl)c3)nc(nc12)C#Cc1ccc(cc1)S(O)(=O)=O
: