Target
Adenosine receptor A3
Ligand
BDBM50420421
Substrate
Meas. Tech.
ChEMBL_969851 (CHEMBL2404651)
Ki
1480±n/a nM
Citation
 Paoletta, STosh, DKFinley, AGizewski, ETMoss, SMGao, ZGAuchampach, JASalvemini, DJacobson, KA Rational design of sulfonated A3 adenosine receptor-selective nucleosides as pharmacological tools to study chronic neuropathic pain. J Med Chem 56:5949-63 (2014)  
Target
Name:
Adenosine receptor A3
Synonyms:
A3AR Adenosine A3 receptor Gpcr2
Type:
PROTEIN
Mol. Mass.:
36460.91
Organism:
Mus musculus
Description:
ChEMBL_1515686
Residue:
319
  
Inhibitor
Name:
BDBM50420421
Synonyms:
CHEMBL2089339
Type:
Small organic molecule
Emp. Form.:
C21H21N5O2
Mol. Mass.:
375.4237
SMILES:
CCNc1nc(nc2n(cnc12)[C@@H]1[C@H]2C[C@H]2[C@@H](O)[C@H]1O)C#Cc1ccccc1
: