Target
Adenosine receptor A1
Ligand
BDBM50420426
Substrate
Meas. Tech.
ChEMBL_969854 (CHEMBL2404654)
Ki
1110±n/a nM
Citation
 Paoletta, STosh, DKFinley, AGizewski, ETMoss, SMGao, ZGAuchampach, JASalvemini, DJacobson, KA Rational design of sulfonated A3 adenosine receptor-selective nucleosides as pharmacological tools to study chronic neuropathic pain. J Med Chem 56:5949-63 (2014)  
Target
Name:
Adenosine receptor A1
Synonyms:
AA1R_MOUSE Adenosine receptor A1 | Adora1
Type:
PROTEIN
Mol. Mass.:
36646.06
Organism:
Mus musculus
Description:
ChEMBL_479902
Residue:
326
  
Inhibitor
Name:
BDBM50420426
Synonyms:
CHEMBL2089345
Type:
Small organic molecule
Emp. Form.:
C32H26ClN5O2
Mol. Mass.:
548.034
SMILES:
O[C@@H]1[C@@H]2C[C@@H]2[C@H]([C@@H]1O)n1cnc2c(NCc3cccc(Cl)c3)nc(nc12)C#Cc1ccc(cc1)-c1ccccc1
: