Target
ALK tyrosine kinase receptor
Ligand
BDBM50436850
Substrate
Meas. Tech.
ChEMBL_969591 (CHEMBL2406433)
IC50
0.200000±n/a nM
Citation
 Chen, JJiang, CWang, S LDK378: a promising anaplastic lymphoma kinase (ALK) inhibitor. J Med Chem 56:5673-4 (2014)  
Target
Name:
ALK tyrosine kinase receptor
Synonyms:
ALK ALK_HUMAN CD_antigen: CD246
Type:
Protein
Mol. Mass.:
176453.10
Organism:
Homo sapiens (Human)
Description:
Q9UM73
Residue:
1620
  
Inhibitor
Name:
BDBM50436850
Synonyms:
CERITINIB LDK378 US10618884, Example 16 | US9809572, Example 16
Type:
Small organic molecule
Emp. Form.:
C28H36ClN5O3S
Mol. Mass.:
558.135
SMILES:
CC(C)Oc1cc(C2CCNCC2)c(C)cc1Nc1ncc(Cl)c(Nc2ccccc2S(=O)(=O)C(C)C)n1
: