Target
Diacylglycerol O-acyltransferase 1
Ligand
BDBM50437385
Substrate
Meas. Tech.
ChEMBL_972632 (CHEMBL2410612)
IC50
36±n/a nM
Citation
 He, SHong, QLai, ZWu, ZYu, YKim, DWTing, PCKuethe, JTYang, GXJian, TLiu, JGuiadeen, DKrikorian, ADSperbeck, DMSonatore, LMWiltsie, JChung, CCGibson, JTLisnock, JMurphy, BAGorski, JNLiu, JChen, DChen, XWolff, MTong, SXMadeira, MKaranam, BVShen, DMBalkovec, JMPinto, SNargund, RPDeVita, RJ Potent DGAT1 Inhibitors in the Benzimidazole Class with a Pyridyl-oxy-cyclohexanecarboxylic Acid Moiety. ACS Med Chem Lett 4:773-8 (2013)  
Target
Name:
Diacylglycerol O-acyltransferase 1
Synonyms:
DGAT1_MOUSE Dgat1 Diacylglycerol O-acyltransferase 1 (DGAT1) | Diglyceride acyltransferase
Type:
Enzyme
Mol. Mass.:
56810.61
Organism:
Mus musculus (mouse)
Description:
In this assay, recombinant mouse DGAT-1 containing an N-terminal His6-epitope tag was produced in the baculovirus expression system.
Residue:
498
  
Inhibitor
Name:
BDBM50437385
Synonyms:
CHEMBL2408621
Type:
Small organic molecule
Emp. Form.:
C25H21N5O3
Mol. Mass.:
439.4659
SMILES:
OC(=O)[C@@H]1CC[C@@H](CC1)Oc1ccc(cn1)-c1ccc(cn1)-c1nc2ccc(cc2[nH]1)C#N
: