Target
Tissue alpha-L-fucosidase
Ligand
BDBM50437447
Substrate
Meas. Tech.
ChEMBL_974498 (CHEMBL2412771)
IC50
208000±n/a nM
Citation
 Mondon, MLecornué, FGuillard, JNakagawa, SKato, ABlériot, Y Skeletal rearrangement of seven-membered iminosugars: synthesis of (-)-adenophorine, (-)-1-epi-adenophorine and derivatives and evaluation as glycosidase inhibitors. Bioorg Med Chem 21:4803-12 (2013)  
Target
Name:
Tissue alpha-L-fucosidase
Synonyms:
Alpha-L-fucosidase 1 FUCO_BOVIN
Type:
PROTEIN
Mol. Mass.:
54093.12
Organism:
Bos taurus
Description:
ChEMBL_335897
Residue:
468
  
Inhibitor
Name:
BDBM50437447
Synonyms:
CHEMBL2409343
Type:
Small organic molecule
Emp. Form.:
C8H17NO4
Mol. Mass.:
191.2249
SMILES:
CC[C@H]1N[C@@H](CO)[C@@H](O)[C@H](O)[C@H]1O
: